{"text_format":"1","workbook":"xlsx","n_sheets":11,"sheets":["EingabeMaske","Berechnung und Ergebnis","Vergleichsdaten 2021","Vergleichsdaten 2022","Vergleichsfaktoren 2021 (2)","Vergleichsdaten 2023","GebStandard","RND","modifizierte RND","Werte","Werte 2"],"not_rendered":{"charts":1,"images":8,"macros":1,"external_links":1,"defined_names":411,"comments":2,"pivot_tables":0},"unopened":[],"bounds":{"document_bytes":16777216,"sheet_cells":100000,"rows_first":2000,"rows_last":500,"rows_between":2000,"halvings":0,"cell_chars":16384,"cell_head_chars":4096},"cells_cut":0,"cells_raw":0,"read":"whole","date_system":"1900"}

{"sheet":"EingabeMaske","index":0,"n_rows":36,"n_cols":13,"rows_kept":36,"cut":false,"hidden":false,"merged":[[25,9,25,11],[27,9,27,11],[30,9,30,12],[31,9,31,11],[35,0,35,4],[35,8,35,12],[26,0,26,2],[25,0,25,2],[26,9,26,10],[3,0,3,4],[12,10,12,12],[11,1,11,3],[4,0,4,4],[5,0,5,4],[8,0,8,3],[12,1,13,3],[12,0,13,0],[14,9,14,11],[20,1,20,2],[23,9,23,11],[24,9,24,11],[15,9,15,11],[16,9,16,11],[18,9,18,11],[20,9,20,11],[21,9,21,11],[19,0,19,2],[19,9,19,11],[22,5,22,7],[17,9,17,10]]}
[null,null,null,"EFH-Rechner, Version 1 - 2023",null,null,null,null,null,null,null,null,{"$f":"D1","v":"EFH-Rechner, Version 1 - 2023"}]
[]
[]
["Vergleichswertberechnung für Einfamilienwohnhäuser mittels Vergleichswertfaktoren des Landesgrundstücksmarktberichtes 2021"]
["gem. § 182 Abs.2 BewG i. V. m. § 183 BewG. ",null,"Carport"]
[]
["Bitte Hinweise in den Kommentarfeldern in Spalte \"E\" beachten.",null,null,null,null,null,null,null,null,"keine Angabe"]
["Eingabefelder blau","Berechnungsfelder rot"]
[]
["Angaben zum Wertermittlungsobjekt",null,null,null,null,null,null,null,null,"Angaben zum Richtwertobjekt"]
[]
["Adresse und Ort:","Musterstraße 13, 00000 Musterstadt"]
["Gemeinde / Gemarkung / Landkreis bzw. Stadt:"," /  / ",null,null,null,null,null,null,null,"Gemeinde / Gemarkung / Landkreis bzw. Stadt:",{"$f":"B13","v":" /  / "},null,"Bobenheim-Roxheim - Roxheim"]
[null,null,null,null,null,null,null,"1960-01-01",null,"Marktsegment",null,null,{"$f":"ROUND(VLOOKUP(EingabeMaske!B13,'Vergleichsfaktoren 2021 (2)'!A8:I3023,6,FALSE),0)","v":0}]
[null,null,null,null,null,null,null,null,null,"Stichtag:",null,null,"2020-01-01"]
{"$rows_left_out":22}
{"sheet":"Berechnung und Ergebnis","index":1,"n_rows":130,"n_cols":6,"rows_kept":130,"cut":false,"hidden":false,"merged":[[3,0,3,5],[4,0,4,5],[2,0,2,5],[5,1,5,5],[47,0,47,5],[15,1,15,4],[16,1,16,4],[21,1,21,4],[11,0,11,4],[17,1,17,4],[125,3,125,5],[36,0,36,5],[54,0,54,5],[19,1,19,3],[38,0,38,5],[71,0,71,5],[103,0,103,5],[94,0,94,5],[98,1,98,3],[120,0,120,3],[123,0,123,5],[87,0,87,5],[112,0,112,3],[114,0,114,5],[118,0,119,3],[45,0,45,3]]}
[null,null,null,null,null,{"$f":"EingabeMaske!D1","v":"EFH-Rechner, Version 1 - 2023"}]
[]
["Vergleichswertberechnung für Ein-/Zweifamilienwohnhäuser mittels Vergleichswertfaktoren des Landesgrundstücksmarktberichtes 2021"]
["gem. § 182 Abs.2 BewG i. V. m. § 183 BewG. "]
[]
["Bezeichnung des Wertermittlungsobjekts\nder Bewertung nach § 183 BewG",{"$f":"EingabeMaske!B12","v":"Musterstraße 13, 00000 Musterstadt"}]
[]
["Angaben zum Wertermittlungsobjekt (WO)"]
[]
["Wertermittlungsstichtag (WST):",null,null,{"$f":"EingabeMaske!H16","v":" "},null,{"$f":"EingabeMaske!D16","v":"2020-01-01"}]
["gesamte Grundstücksgröße (gGG):",null,null,{"$f":"EingabeMaske!H19","v":" "},null,{"$f":"ROUND(EingabeMaske!D19,0)","v":500}]
["bei Aufteilung des Grundstücks in Bewertungsteilflächen: Grundstücksteilfläche (überbaute Fläche zzgl. Umgriffsfläche):",null,null,null,null,{"$f":"LOOKUP(EingabeMaske!A20,Bewertungsgrundstück,'Werte 2'!C2:C4)","v":0}]
["Gebäudestandardstufe (GST): ","(gemäß Erklärung, hilfsweise Schätzung)",null,null,null,{"$f":"ROUND(EingabeMaske!D21,2)","v":3}]
["Wohnfläche (WF):",null,null,null,null,{"$f":"ROUND(EingabeMaske!D22,0)","v":145}]
["Baujahr (BJ):",null,null,null,null,{"$f":"EingabeMaske!D23","v":2005}]
{"$rows_left_out":116}
{"sheet":"Vergleichsdaten 2021","index":2,"n_rows":171,"n_cols":10,"rows_kept":171,"cut":false,"hidden":true,"merged":[]}
["     Quelle: Oberer Gutachterausschuss für Grundstückswerte Rheinland-Pfalz gem. Landesgrundstückmarkbericht 2021",null,null,null,"EFH-Rechner, Version 2.2 - 2021"]
[]
[]
[]
["Berücksichtigung der Wertverhältnisse zwischen dem Richtwertstichtag und dem Wertermittlungsstichtag"]
[null,{"$f":"EingabeMaske!D$16","v":"2020-01-01"},null,null,"Interpolation!",null,null,"Ergänzung "]
[null,{"$f":"B6-DATE(YEAR(B6)-1,12,31.25)","v":1},2023,{"$f":"(G7-G8)*$B$15/365+G8","v":152},"2022-01-01","2022-12-31",152,{"$f":"ROUND(IF(YEAR($B$6)+1=C7,D7,0),2)","v":0}]
[null,{"$f":"B6-DATE(YEAR(B6)-1,12,31.25)","v":1},2022,152,"2021-01-01","2021-12-31",152,{"$f":"ROUND(IF(YEAR($B$6)+1=C8,D8,0),2)","v":0}]
[null,{"$f":"B6-DATE(YEAR(B6)-1,12,31.25)","v":1},2021,{"$f":"(G9-G10)*$B$15/365+G10","v":142.02739726027397},"2020-01-01","2020-12-31",152,142.03]
[null,{"$f":"B6-DATE(YEAR(B6)-1,12,31.25)","v":1},2020,133.02465753424659,"2019-01-01","2019-12-31",142,0]
[null,{"$f":"B6-DATE(YEAR(B6)-1,12,31.25)","v":1},2019,{"$f":"(G11-G12)*$B$15/365+G12","v":125.02191780821917},"2018-01-01","2018-12-31",133,0]
[null,{"$f":"B6-DATE(YEAR(B6)-1,12,31.25)","v":1},2018,118.01917808219179,"2017-01-01","2017-12-31",125,0]
[null,{"$f":"B6-DATE(YEAR(B6)-1,12,31.25)","v":1},2017,112.01643835616439,"2016-01-01","2016-12-31",118,0]
[null,{"$f":"B6-DATE(YEAR(B6)-1,12,31.25)","v":1},2016,109.00821917808219,"2015-01-01","2015-12-31",112,0]
[null,{"$f":"B6-DATE(YEAR(B6)-1,12,31.25)","v":1},2015,108.0027397260274,"2014-01-01","2014-12-31",109,0]
{"$rows_left_out":157}
{"sheet":"Vergleichsdaten 2022","index":3,"n_rows":297,"n_cols":11,"rows_kept":297,"cut":false,"hidden":true,"merged":[]}
[{"$f":"EingabeMaske!A36","v":"     Quelle: Oberer Gutachterausschuss für Grundstückswerte Rheinland-Pfalz gem. Landesgrundstückmarkbericht 2021"},null,null,null,{"$f":"EingabeMaske!D1","v":"EFH-Rechner, Version 1 - 2023"}]
[]
["Wohnfläche",145]
["Gebäudesachwert ohne Außenanlagen und"]
["Nebengebäude zum Stichtag 1.1.2020",{"$f":"B3*EingabeMaske!M17/B12","v":{"$error":"#DIV/0!"}},null,{"$f":"B5*J37","v":{"$error":"#DIV/0!"}}]
["Gebäudestandard",3]
["Gesamtnutzungsdauer (GND)",70]
["Restnutzungsdauer (RND)",55]
["Zeitwert der Außen- und Nebenanlagen",0]
["Zeitwert der Außen- und Nebenanlagen",0]
["Grundstücksgröße",500]
["Sachwertfaktor (freistehend)",{"$f":"ROUND(VLOOKUP(EingabeMaske!B13,'Vergleichsfaktoren 2021 (2)'!A8:I3023,9,FALSE),2)","v":0}]
[]
["1) Die Alterswertminderung des Herstellungswertes des Gebäudes ist bereits im Gebäudesachwert enthalten."]
[]
{"$rows_left_out":283}
{"sheet":"Vergleichsfaktoren 2021 (2)","index":4,"n_rows":3023,"n_cols":9,"rows_kept":3023,"cut":false,"hidden":true,"merged":[]}
[null,"Vergleichsfaktoren (VF) für mit freistehenden Einfamilienwohnhäusern bebaute Grundstücke "]
[null,null,null,"Stichtag ","2020-01-01"]
[null," Modell s. LGMB 2021, Kap. 3.6.1.1 - © Oberer Gutachterausschuss für Grundstückswerte Rheinland-Pfalz"]
[null,"Kurzbeschreibung des Richtwertgrundstücks: Größe 500 m², mittlerer Standard, freistehend KG+EG+ausgeb. DG, Wohnfäche 145 m², Alter 15 Jahre "]
[null,"Hinweis: Sollte eine Gemarkung nicht nachgewiesen sein, kann eine vergleichbare Gemarkung desselben Marktsegments herangezogen werden. "]
["Ergänzung LfSt"]
["Gemeinde / Gemarkung / Landkreis bzw. Stadt","Nr.","Gemarkung","Gemeinde","Landkreis/kreisfreie Stadt","Markt-segment Nr.","BWN €/m² Grdst.fl.","RW €/m² Wohnfl.","SWF"]
[{"$f":"TRIM(D8)&\" / \"&TRIM(C8)&\" / \"&TRIM(E8)","v":"0 / 0 / 0"},0,0,0,0,0,0,null,0]
[{"$f":"TRIM(D9)&\" / \"&TRIM(C9)&\" / \"&TRIM(E9)","v":" /  / "}]
[" /  / "]
[" /  / "]
[" /  / "]
[" /  / "]
[" /  / "]
[" /  / "]
{"$rows_left_out":3009}
{"sheet":"Vergleichsdaten 2023","index":5,"n_rows":185,"n_cols":10,"rows_kept":185,"cut":false,"hidden":true,"merged":[]}
[{"$f":"EingabeMaske!A36","v":"     Quelle: Oberer Gutachterausschuss für Grundstückswerte Rheinland-Pfalz gem. Landesgrundstückmarkbericht 2021"},null,null,null,{"$f":"EingabeMaske!D1","v":"EFH-Rechner, Version 1 - 2023"}]
[]
[]
[]
["Berücksichtigung der Wertverhältnisse zwischen dem Richtwertstichtag und dem Wertermittlungsstichtag"]
[null,{"$f":"EingabeMaske!D$16","v":"2020-01-01"},null,null,"Interpolation!",null,null,"Ergänzung "]
[null,{"$f":"B$6-DATE(YEAR(B$6)-1,12,31.25)","v":1},2025,180.03287671232877,"2024-01-01","2024-12-31",192,{"$f":"ROUND(IF(YEAR($B$6)+1=C7,D7,0),2)","v":0}]
[null,{"$f":"B$6-DATE(YEAR(B$6)-1,12,31.25)","v":1},2024,192,"2023-01-01","2023-12-31",192,0]
[null,1,2023,180.03287671232877,"2022-01-01","2022-12-31",192,0]
[null,{"$f":"B6-DATE(YEAR(B6)-1,12,31.25)","v":1},2022,163.04657534246576,"2021-01-01","2021-12-31",180,{"$f":"ROUND(IF(YEAR($B$6)+1=C10,D10,0),2)","v":0}]
[null,{"$f":"B6-DATE(YEAR(B6)-1,12,31.25)","v":1},2021,147.04383561643834,"2020-01-01","2020-12-31",163,147.04]
[null,{"$f":"B6-DATE(YEAR(B6)-1,12,31.25)","v":1},2020,134.03561643835616,"2019-01-01","2019-12-31",147,0]
[null,{"$f":"B6-DATE(YEAR(B6)-1,12,31.25)","v":1},2019,125.02465753424657,"2018-01-01","2018-12-31",134,0]
[null,{"$f":"B6-DATE(YEAR(B6)-1,12,31.25)","v":1},2018,118.01917808219179,"2017-01-01","2017-12-31",125,0]
[null,{"$f":"B6-DATE(YEAR(B6)-1,12,31.25)","v":1},2017,112.01643835616439,"2016-01-01","2016-12-31",118,0]
{"$rows_left_out":171}
{"sheet":"GebStandard","index":6,"n_rows":25,"n_cols":19,"rows_kept":25,"cut":false,"hidden":false,"merged":[[0,1,0,11],[1,6,1,10],[24,1,24,3]]}
[null,"Gebäudestandards und Wägungsanteile für Ein- und Zweifamilienhäuser, Stufen 1-5 gemäß Anlage 2 der SW-RL"]
[]
[]
[null,"Wägungsan- teile (∑100 %)","Stufe 1",null,"Stufe 2",null,"Stufe 3",null,"Stufe 4",null,"Stufe 5"]
[null,"Außenwände","Holzfachwerk, Ziegelmauerwerk; Fugenglattstrich, Putz, Verkleidung mit Faserzementplatten, Bitumenschindeln oder einfachen Kunststoffplatten; kein oder deutlich nicht zeitgemäßer Wärmeschutz (vor ca. 1980)",null,"ein-/zweischaliges Mauerwerk, z. B. Gitterziegel oder Hohlblocksteine; verputzt und gestrichen oder Holzverkleidung; nicht zeitgemäßer Wärmeschutz (vor ca. 1995)",null,"ein-/zweischaliges Mauerwerk, z. B. aus Leichtziegeln, Kalksandsteinen, Gasbetonsteinen; Edelputz; Wärmedämmverbundsystem oder Wärmedämmputz (nach ca. 1995)",null,"Verblendmauerwerk, zweischalig, hinterlüftet, Vorhangfassade (z. B. Naturschiefer); Wärmedämmung (nach ca. 2005)",null,"aufwendig gestaltete Fassaden mit konstruktiver Gliederung (Säulenstell-ungen, Erker etc.), Sichtbeton-Fertig-teile, Natursteinfassade, Elemente aus Kupfer-/Eloxalblech, mehrgeschoss. Glasfassaden; hochwertigste Dämmung",null,null,{"$f":"IF(N6=TRUE,1,0)","v":0},{"$f":"IF(O6=TRUE,1,0)","v":0},1,0,0]
[null,"23%",{"$f":"ROUND($B6/$S6*N5,4)","v":0},null,{"$f":"ROUND($B6/$S6*O5,4)","v":0},null,{"$f":"ROUND($B6/$S6*P5,4)","v":0.23},null,{"$f":"ROUND($B6/$S6*Q5,4)","v":0},null,{"$f":"ROUND($B6/$S6*R5,4)","v":0},null,null,false,false,true,false,false,{"$f":"COUNTIF(N6:R6,TRUE)","v":1}]
[null,"Dach","Dachpappe, Faserzementplatten/ Wellplatten; keine bis geringe Dachdämmung",null,"einfache Betondachsteine oder Tondachziegel,  Bitumenschindeln; nicht zeitgemäße Dachdämmung (vor ca. 1995)",null,"Faserzement-Schindeln, beschichtete Betondachsteine und Tondachziegel, Folienabdichtung; Dachdämmung (nach ca. 1995)",null,"glasierte Tondachziegel, Flachdach- ausbildung tlw. als Dachterrassen; Konstruktion in Brettschichtholz, schweres Massivflachdach; besondere Dachformen, z. B. Mansarden-, Walmdach; Aufsparrendämmung, überdurchschn. Dämmung (nach ca. 2005)",null,"hochwertige Eindeckung z. B. aus Schiefer oder Kupfer, Dachbegrünung, befahrbares Flachdach; stark überdurchschnittliche Dämmung",null,null,{"$f":"IF(N8=TRUE,1,0)","v":0},{"$f":"IF(O8=TRUE,1,0)","v":0},1,0,0]
[null,"15%",{"$f":"ROUND($B8/$S8*N7,4)","v":0},null,{"$f":"ROUND($B8/$S8*O7,4)","v":0},null,{"$f":"ROUND($B8/$S8*P7,4)","v":0.15},null,{"$f":"ROUND($B8/$S8*Q7,4)","v":0},null,{"$f":"ROUND($B8/$S8*R7,4)","v":0},null,null,false,false,true,false,false,{"$f":"COUNTIF(N8:R8,TRUE)","v":1}]
[null,"Fenster und Außentüren","Einfachverglasung; einfache Holztüren",null,"Zweifachverglasung (vor ca. 1995); Haustür mit nicht zeitgemäßem Wärmeschutz (vor ca. 1995)",null,"Zweifachverglasung (nach ca. 1995), Rollläden (manuell); Haustür mit zeitgemäßem Wärmeschutz (nach ca. 1995)",null,"Dreifachverglasung, Sonnenschutz- glas, aufwendigere Rahmen, Rollläden (elektr.); höherwertige Türanlagen z. B. mit Seitenteil, besonderer Einbruchschutz",null,"große feststehende Fensterflächen, Spezialverglasung (Schall- und Sonnenschutz); Außentüren in hochwertigen Materialien",null,null,{"$f":"IF(N10=TRUE,1,0)","v":0},{"$f":"IF(O10=TRUE,1,0)","v":0},1,0,0]
[null,"11%",{"$f":"ROUND($B10/$S10*N9,4)","v":0},null,{"$f":"ROUND($B10/$S10*O9,4)","v":0},null,{"$f":"ROUND($B10/$S10*P9,4)","v":0.11},null,{"$f":"ROUND($B10/$S10*Q9,4)","v":0},null,{"$f":"ROUND($B10/$S10*R9,4)","v":0},null,null,false,false,true,false,false,{"$f":"COUNTIF(N10:R10,TRUE)","v":1}]
[null,"Innenwände und -türen","Fachwerkwände, einfache Putze/Lehmputze, einfache Kalkanstriche; Füllungstüren, gestrichen, mit einfachen Beschlägen ohne Dichtungen",null,"massive tragende Innenwände, nicht tragende Wände in Leichtbauweise   (z. B. Holzständerwände mit Gipskarton), Gipsdielen; leichte Türen, Stahlzargen",null,"nicht tragende Innenwände in massiver Ausführung bzw. mit Dämmmaterial gefüllte Ständerkonstruktionen; schwere Türen",null,"Sichtmauerwerk; Massivholztüren, Schiebetürelemente, Glastüren, strukturierte Türblätter",null,"gestaltete Wandabläufe (z. B. Pfeilervorlagen, abgesetzte oder geschwungene Wandpartien);  Brandschutzverkleidung; raumhohe aufwendige Türelemente",null,null,{"$f":"IF(N12=TRUE,1,0)","v":0},{"$f":"IF(O12=TRUE,1,0)","v":0},1,0,0]
[null,"11%",{"$f":"ROUND($B12/$S12*N11,4)","v":0},null,{"$f":"ROUND($B12/$S12*O11,4)","v":0},null,{"$f":"ROUND($B12/$S12*P11,4)","v":0.11},null,{"$f":"ROUND($B12/$S12*Q11,4)","v":0},null,{"$f":"ROUND($B12/$S12*R11,4)","v":0},null,null,false,false,true,false,false,{"$f":"COUNTIF(N12:R12,TRUE)","v":1}]
[null,"Deckenkon- struktion","Holzbalkendecken ohne Füllung, Spalierputz; Weichholztreppen in einfacher Art und Ausführung; kein Trittschallschutz",null,"Holzbalkendecken mit Füllung, Kappendecken; Stahl- oder Hartholztreppen in einfacher Art und Ausführung",null,"Beton- und Holzbalkendecken mit Tritt- und Luftschallschutz (z. B. schwimmender Estrich); geradläufige Treppen aus Stahlbeton oder Stahl, Harfentreppe, Trittschallschutz",null,"Decken mit größerer Spannweite, Deckenverkleidung (Holzpaneele/Kasseten); gewendelte Treppen aus Stahlbeton oder Stahl, Hartholztreppenanlage in besserer Art und Ausführung",null,"Decken mit großen Spannweiten, Deckenvertäfelungen (Edelholz, Metall); breite Stahlbeton-, Metall- oder Holztreppenanlage mit hochwertigem Geländer",null,null,{"$f":"IF(N14=TRUE,1,0)","v":0},{"$f":"IF(O14=TRUE,1,0)","v":0},1,0,0]
[null,"11%",{"$f":"ROUND($B14/$S14*N13,4)","v":0},null,{"$f":"ROUND($B14/$S14*O13,4)","v":0},null,{"$f":"ROUND($B14/$S14*P13,4)","v":0.11},null,{"$f":"ROUND($B14/$S14*Q13,4)","v":0},null,{"$f":"ROUND($B14/$S14*R13,4)","v":0},null,null,false,false,true,false,false,{"$f":"COUNTIF(N14:R14,TRUE)","v":1}]
[null,"Fußböden ","ohne Belag",null,"Linoleum-, Teppich-, Laminat- und PVC-Böden einfacher Art und Ausführung",null,"Linoleum-, Teppich-, Laminat- und PVC-Böden besserer Art und Ausführung, Fliesen, Kunststeinplatten",null,"Natursteinplatten, Fertigparkett, hochwertige Fliesen, Terrazzobelag, hochwertige Massivholzböden auf aufgedämmter Unterkonstruktion",null,"hochwertiges Parkett, hochwertige Natursteinplatten, hochwertige Edelholzböden auf gedämmter Unterkonstruktion",null,null,{"$f":"IF(N16=TRUE,1,0)","v":0},{"$f":"IF(O16=TRUE,1,0)","v":0},1,0,0]
{"$rows_left_out":11}
{"sheet":"RND","index":7,"n_rows":35,"n_cols":18,"rows_kept":35,"cut":false,"hidden":false,"merged":[[34,1,34,3],[33,1,33,4],[33,5,33,8],[34,5,34,8],[0,0,0,9],[1,0,1,9],[2,1,2,4],[2,5,2,7],[2,9,3,9],[3,0,3,4],[3,5,3,7],[4,0,4,4],[4,5,4,7],[5,0,5,4],[5,5,5,7],[6,0,6,4],[6,5,6,7],[7,0,7,4],[7,5,7,7],[8,0,8,4],[8,5,8,7],[9,0,9,4],[9,5,9,7],[10,0,10,4],[10,5,10,7],[11,0,11,4],[11,5,11,7],[12,0,12,4],[12,5,12,7],[25,11,25,15],[14,0,16,9],[17,0,17,9],[18,0,18,4],[18,5,18,7],[19,0,19,4],[20,0,20,4],[21,0,21,4],[22,0,22,4],[23,0,23,4],[24,0,24,8],[25,0,25,8],[32,1,32,3],[32,5,32,7],[26,0,31,0],[26,5,26,8],[27,1,27,4],[27,5,27,8],[28,1,28,4],[28,5,28,7],[29,1,29,8],[30,1,30,4],[30,5,30,7],[31,5,31,7]]}
["Modell zur Ableitung der wirtschaftlichen Restnutzungsdauer für Wohngebäude unter Berücksichtigung von Modernisierungen (SW-RL Anl. 4) "]
["für Ein- und Zweifamilienhäuser"]
["Objekt",null,null,null,null,"Satz-Nr.",null,null,null," Kommentar"]
["Modernisierungselemente",null,null,null,null,"max. Punkte",null,null,"tats. Punkte"]
["Dacherneuerung inklusive Verbesserung der Wärmedämmung",null,null,null,null,4,null,null,null,null,60,1]
["Modernisierung der Fenster und Außentüren",null,null,null,null,{"$f":"IF(I6>3,\"TILT max. 2 \",2)","v":2},null,null,null,null,65,2]
["Modernisierung der Leitungssysteme (Strom, Gas, Wasser, Abwasser)",null,null,null,null,{"$f":"IF(I7>3,\"TILT max. 2 \",2)","v":2},null,null,null,null,70,3]
["Modernisierung der Heizungsanlage",null,null,null,null,{"$f":"IF(I8>3,\"TILT max. 2 \",2)","v":2},null,null,null,null,75,4]
["Wärmedämmung der Außenwände",null,null,null,null,4,null,null,null,null,80]
["Modernisierung von Bädern ",null,null,null,null,{"$f":"IF(I10>3,\"TILT max. 2 \",2)","v":2},null,null,null,null,90]
["Modernisierung des Innenausbaus, z.B. Decken, Fußböden, Treppen",null,null,null,null,2,null,null,null,null,null,{"$f":"IF(AND(I3<>\"\",I13=0),\"Einblenden\",\"Ausblenden\")","v":"Ausblenden"}]
["Wesentliche Verbesserung der Grundrissgestaltung",null,null,null,null,2]
["Summe",null,null,null,null,{"$f":"SUM(F5:F12)","v":20},null,null,{"$f":"SUM(I5:I12)","v":0},null,null,{"$f":"IF(I13>0,#REF!=0)","v":false}]
[]
["Liegen die Maßnahmen weiter zurück, ist zu prüfen, ob nicht ein geringerer als der maximale Tabellenwert anzusetzen ist.\nSofern nicht modernisierte Bauelemente noch zeitgemäßen Ansprüchen genügen, sind entsprechende Punkte zu vergeben."]
{"$rows_left_out":21}
{"sheet":"modifizierte RND","index":8,"n_rows":37,"n_cols":23,"rows_kept":37,"cut":false,"hidden":true,"merged":[[4,0,4,6],[0,0,0,6],[1,0,1,6],[2,0,2,6],[3,0,3,2],[3,5,3,6],[8,22,14,22],[5,0,5,2],[5,5,5,6],[6,0,6,6],[7,5,7,6],[8,0,8,6],[8,16,11,16],[9,5,9,6],[10,0,12,6],[8,17,14,17],[8,18,14,18],[8,19,14,19],[8,20,14,20],[8,21,14,21],[18,0,37,0],[18,6,37,6],[37,1,37,5],[13,0,13,6],[14,0,14,6],[15,0,16,0],[15,2,16,4],[15,6,16,6],[17,0,17,6]]}
["Ermittlung der modifizierten Restnutzungsdauer"]
["SW-Modell AGVGA NRW    -    Anlage 4"]
[]
[" tatsächliches Gebäudealter (Alter):",null,null,{"$f":"RND!F29","v":15},"     Jahre",{"$f":"IF(D4<0,\"Negative Jahre ???\",\"\")","v":""}]
[]
[" Modernisierungsgrad:",null,null,{"$f":"IF(RND!I13<>0,RND!I13,RND!I13)","v":0},"     Punkte",{"$f":"IF(D6=\"\",\"\",IF(D6<=K16,\"(Modernisierungsstufe 1)\",IF(D6<6,\"(Modernisierungsstufe 2)\",IF(AND(D6>5,D6<11),\"(Modernisierungsstufe 3)\",IF(AND(D6>10,D6<18),\"(Modernisierungsstufe 4)\",IF(D6>=K33,\"(Modernisierungsstufe 5)\",\"\"))))))","v":"(Modernisierungsstufe 1)"}]
[]
[" Gesamtnutzungsdauer (GND):",null,null,{"$f":"RND!F31","v":70},"     Jahre",null,null,null,null,null,"mögliche Gesamtnutzungsdauer:",null,null,null,"relatives Gebäudealter"]
[null,null,null,null,null,null,null,null,null,null,60,null,null,null,{"$f":"D4/D8","v":0.21428571428571427},null,"Alter für Formel\nmax. Alter der GND","Prüfung, ob Formel anwendbar\n( \"ab einem relativen Alter\")","Formel nicht anwendbar, daher Jahre durch Abzug\nRND=GND-Alter\naber max. 80 Jahre!","Formel anwendbar\n\nmod. RND in Jahren","modifizierte RND","interpoliert ?","GND - Alter ?"]
[" modifizierte Restnutzungsdauer:",null,null,{"$f":"IF(D6=0,D8-D4,IF(AND(D4=\"\",D6=\"\",D8=\"\"),\"\",IF(D4<>\"\",IF(D6=\"\",\"Punkte ?\",IF(D8=\"\",\"GND ?\",U34)),\"s.o.\")))","v":55},"    Jahre",null,null,null,null,null,65]
["Bei der angezeigten modifizierten Restnutzungsdauer handelt es sich um eine interpolierte, mathematisch berechnete Zahl !",null,null,null,null,null,null,null,null,null,70]
[null,null,null,null,null,null,null,null,null,null,75]
[null,null,null,null,null,null,null,null,null,null,80]
["Tabelle zur Ermittlung der modifizierten Restnutzungsdauer",null,null,null,null,null,null,null,null,null,90,null,null,null,null,null,{"$f":"IF(D4>D8,D8,D4)","v":15}]
[null,null,null,null,null,null,null,null,null,null,"Modernisierungsgrad:",null,{"$f":"IF(D6=K16,1,IF(D6=K33,18,D6))","v":0},"a","b","c"]
{"$rows_left_out":23}
{"sheet":"Werte","index":9,"n_rows":10,"n_cols":1,"rows_kept":10,"cut":false,"hidden":true,"merged":[]}
["Garage"]
["Doppelgarage"]
["Carport"]
["Carport und Garage"]
["Sonstiges (freie Eingabe)"]
[]
[]
["freistehend"]
["Doppelhaushäfte / Reihenendhaus"]
["Reihenmittelhaus"]

{"sheet":"Werte 2","index":10,"n_rows":4,"n_cols":14,"rows_kept":4,"cut":false,"hidden":true,"merged":[]}
["Bewertungsgrundstück","WO gesamt","WO","BRW","UK WO","UK RW",null,null,null,null,"Restfläche"]
["Fall 1: Eine Aufteilung in selbstständig verwertbare und baulich nutzbare Teilflächen ist möglich. Die Teilfläche des bebauten Grundstücksteils (überbaute Fläche zzgl. Umgriffsfläche) beträgt:",{"$f":"EingabeMaske!D19","v":500},{"$f":"EingabeMaske!D20","v":0},{"$f":"EingabeMaske!D27","v":500},{"$f":"IF(C2*D2>0,1.7*C2^(-0.0855),\"\")","v":""},{"$f":"IF(C2*D2>0,1.7*D2^(-0.0855),\"\")","v":""},{"$f":"IF(C2*D2>0,E2/F2,1)","v":1},{"$f":"B2-C2","v":500},"selbstständig verwertbare Teilfläche","Anpassung an die Grundstücksgröße",{"$f":"IF(C2=0,0,B2-C2)","v":0},{"$f":"IF(C2*D2>0,1.7*K2^(-0.0855),\"\")","v":""},{"$f":"IF(C2*D2>0,L2/F2,1)","v":1},{"$f":"IF(EingabeMaske!D20=0,\"Angabe der Fläche erforderlich\",\"\")","v":"Angabe der Fläche erforderlich"}]
["Fall 2: Die mittlere Grundstückstiefe liegt über 40 m. Eine Aufteilung in selbstständig verwertbare und baulich nutzbare Teilflächen ist nicht möglich. Die Fläche bis zu 40 m Tiefe (Vorderland) beträgt:",{"$f":"EingabeMaske!D19","v":500},{"$f":"EingabeMaske!D20","v":0},{"$f":"EingabeMaske!D27","v":500},{"$f":"IF(C3*D3>0,1.7*C3^(-0.0855),\"\")","v":""},{"$f":"IF(C3*D3>0,1.7*D3^(-0.0855),\"\")","v":""},{"$f":"IF(C3*D3>0,E3/F3,1)","v":1},{"$f":"B3-C3","v":500},"Hinterlandfläche","Wertfaktor für Hinterland",{"$f":"IF(C3=0,0,B3-C3)","v":0},{"$f":"IF(C3*D3>0,1.7*K3^(-0.0855),\"\")","v":""},0.25,{"$f":"IF(EingabeMaske!D20=0,\"Angabe der Fläche erforderlich\",\"\")","v":"Angabe der Fläche erforderlich"}]
["Fall 3: Eine Aufteilung in selbstständig verwertbare und baulich nutzbare Teilflächen ist nicht möglich. Die mittlere Tiefe des Grundstücks liegt unter 40 m. Eintrag auf 0 setzen.",{"$f":"EingabeMaske!D19","v":500},0,{"$f":"EingabeMaske!D27","v":500},{"$f":"IF(D4>0,1.7*B4^(-0.0855),\"\")","v":0.99927951831873274},{"$f":"IF(D4>0,1.7*D4^(-0.0855),\"\")","v":0.99927951831873274},{"$f":"IF(D4>0,E4/F4,1)","v":1},{"$f":"0","v":0},null,null,0,null,null,{"$f":"IF(EingabeMaske!D20>0,\"Eintag auf 0 m² setzen\",\"\")","v":""}]